Travis CI: Maven no consigue la dependencia de Kotlin 1.1.1 en Linux

Actualicé Kotlin a la última versión (1.1.1) en mi proyecto Maven y ahora la compilation de Travis CI falla en Linux. La construcción de MacOS funciona bien en Travis, así como en mi máquina local.

Parece que no puede encontrar la dependencia. ¿Por qué?

https://travis-ci.org/AlexP11223/minic/jobs/217293085

hostname: travis-worker-gce-org-prod5-1:179fbc84-4d6a-4974-a61a-578cc4c912e2 version: v2.6.1-2-g9fbf704 https://github.com/travis-ci/worker/tree/9fbf704a6a755301e6b86b28a87b3f0636e502a8 ........ Build language: java Build group: stable Build dist: precise ........... Build image provisioning date and time Fri Dec 2 04:42:35 UTC 2016 Operating System Details Distributor ID: Ubuntu Description: Ubuntu 12.04.5 LTS Release: 12.04 ........ Linux Version 3.13.0-103-generic Cookbooks Version 9c6cd11 https://github.com/travis-ci/travis-cookbooks/tree/9c6cd11 ................. Apache Maven 3.2.5 (12a6b3acb947671f09b81f49094c53f426d8cea1; 2014-12-14T17:29:23+00:00) ........... mvn install -DskipTests=true -Dmaven.javadoc.skip=true -B -V Java HotSpot(TM) 64-Bit Server VM warning: ignoring option MaxPermSize=192m; support was removed in 8.0 Apache Maven 3.2.5 (12a6b3acb947671f09b81f49094c53f426d8cea1; 2014-12-14T17:29:23+00:00) Maven home: /usr/local/maven Java version: 1.8.0_111, vendor: Oracle Corporation Java home: /usr/lib/jvm/java-8-oracle/jre Default locale: en_US, platform encoding: UTF-8 OS name: "linux", version: "3.13.0-103-generic", arch: "amd64", family: "unix" ......... [INFO] Downloaded: ......... [INFO] --- kotlin-maven-plugin:1.1.1:compile (compile) @ minic --- [WARNING] The POM for org.jetbrains.kotlin:kotlin-maven-plugin:jar:1.1.1 is missing, no dependency information available [INFO] Downloading: https://repo.maven.apache.org/maven2/org/codehaus/plexus/plexus-utils/1.1/plexus-utils-1.1.jar [INFO] Downloaded: https://repo.maven.apache.org/maven2/org/codehaus/plexus/plexus-utils/1.1/plexus-utils-1.1.jar (165 KB at 2457.0 KB/sec) [WARNING] Error injecting: org.jetbrains.kotlin.maven.K2JVMCompileMojo java.lang.NoClassDefFoundError: com/intellij/util/Processor at java.lang.Class.getDeclanetworkingConstructors0(Native Method) at java.lang.Class.privateGetDeclanetworkingConstructors(Class.java:2671) at java.lang.Class.getDeclanetworkingConstructors(Class.java:2020) at com.google.inject.spi.InjectionPoint.forConstructorOf(InjectionPoint.java:245) at com.google.inject.internal.ConstructorBindingImpl.create(ConstructorBindingImpl.java:99) at com.google.inject.internal.InjectorImpl.createUninitializedBinding(InjectorImpl.java:657) at com.google.inject.internal.InjectorImpl.createJustInTimeBinding(InjectorImpl.java:875) at com.google.inject.internal.InjectorImpl.createJustInTimeBindingRecursive(InjectorImpl.java:798) at com.google.inject.internal.InjectorImpl.getJustInTimeBinding(InjectorImpl.java:281) at com.google.inject.internal.InjectorImpl.getBindingOrThrow(InjectorImpl.java:213) at com.google.inject.internal.InjectorImpl.getProviderOrThrow(InjectorImpl.java:998) at com.google.inject.internal.InjectorImpl.getProvider(InjectorImpl.java:1031) at com.google.inject.internal.InjectorImpl.getProvider(InjectorImpl.java:994) at com.google.inject.internal.InjectorImpl.getInstance(InjectorImpl.java:1044) at org.eclipse.sisu.space.AbstractDefernetworkingClass.get(AbstractDefernetworkingClass.java:48) at com.google.inject.internal.ProviderInternalFactory.provision(ProviderInternalFactory.java:86) at com.google.inject.internal.InternalFactoryToInitializableAdapter.provision(InternalFactoryToInitializableAdapter.java:54) at com.google.inject.internal.ProviderInternalFactory$1.call(ProviderInternalFactory.java:70) at com.google.inject.internal.ProvisionListenerStackCallback$Provision.provision(ProvisionListenerStackCallback.java:113) at org.eclipse.sisu.bean.BeanScheduler$Activator.onProvision(BeanScheduler.java:176) at com.google.inject.internal.ProvisionListenerStackCallback$Provision.provision(ProvisionListenerStackCallback.java:122) at com.google.inject.internal.ProvisionListenerStackCallback.provision(ProvisionListenerStackCallback.java:68) at com.google.inject.internal.ProviderInternalFactory.circularGet(ProviderInternalFactory.java:68) at com.google.inject.internal.InternalFactoryToInitializableAdapter.get(InternalFactoryToInitializableAdapter.java:46) at com.google.inject.internal.InjectorImpl$2$1.call(InjectorImpl.java:1009) at com.google.inject.internal.InjectorImpl.callInContext(InjectorImpl.java:1059) at com.google.inject.internal.InjectorImpl$2.get(InjectorImpl.java:1005) at com.google.inject.Scopes$1$1.get(Scopes.java:59) at org.eclipse.sisu.inject.LazyBeanEntry.getValue(LazyBeanEntry.java:82) at org.eclipse.sisu.plexus.LazyPlexusBean.getValue(LazyPlexusBean.java:51) at org.codehaus.plexus.DefaultPlexusContainer.lookup(DefaultPlexusContainer.java:263) at org.codehaus.plexus.DefaultPlexusContainer.lookup(DefaultPlexusContainer.java:255) at org.apache.maven.plugin.internal.DefaultMavenPluginManager.getConfigunetworkingMojo(DefaultMavenPluginManager.java:464) at org.apache.maven.plugin.DefaultBuildPluginManager.executeMojo(DefaultBuildPluginManager.java:119) at org.apache.maven.lifecycle.internal.MojoExecutor.execute(MojoExecutor.java:208) at org.apache.maven.lifecycle.internal.MojoExecutor.execute(MojoExecutor.java:153) at org.apache.maven.lifecycle.internal.MojoExecutor.execute(MojoExecutor.java:145) at org.apache.maven.lifecycle.internal.LifecycleModuleBuilder.buildProject(LifecycleModuleBuilder.java:116) at org.apache.maven.lifecycle.internal.LifecycleModuleBuilder.buildProject(LifecycleModuleBuilder.java:80) at org.apache.maven.lifecycle.internal.builder.singlethreaded.SingleThreadedBuilder.build(SingleThreadedBuilder.java:51) at org.apache.maven.lifecycle.internal.LifecycleStarter.execute(LifecycleStarter.java:120) at org.apache.maven.DefaultMaven.doExecute(DefaultMaven.java:355) at org.apache.maven.DefaultMaven.execute(DefaultMaven.java:155) at org.apache.maven.cli.MavenCli.execute(MavenCli.java:584) at org.apache.maven.cli.MavenCli.doMain(MavenCli.java:216) at org.apache.maven.cli.MavenCli.main(MavenCli.java:160) at sun.reflect.NativeMethodAccessorImpl.invoke0(Native Method) at sun.reflect.NativeMethodAccessorImpl.invoke(NativeMethodAccessorImpl.java:62) at sun.reflect.DelegatingMethodAccessorImpl.invoke(DelegatingMethodAccessorImpl.java:43) at java.lang.reflect.Method.invoke(Method.java:498) at org.codehaus.plexus.classworlds.launcher.Launcher.launchEnhanced(Launcher.java:289) at org.codehaus.plexus.classworlds.launcher.Launcher.launch(Launcher.java:229) at org.codehaus.plexus.classworlds.launcher.Launcher.mainWithExitCode(Launcher.java:415) at org.codehaus.plexus.classworlds.launcher.Launcher.main(Launcher.java:356) Caused by: java.lang.ClassNotFoundException: com.intellij.util.Processor at org.codehaus.plexus.classworlds.strategy.SelfFirstStrategy.loadClass(SelfFirstStrategy.java:50) at org.codehaus.plexus.classworlds.realm.ClassRealm.unsynchronizedLoadClass(ClassRealm.java:271) at org.codehaus.plexus.classworlds.realm.ClassRealm.loadClass(ClassRealm.java:247) at org.codehaus.plexus.classworlds.realm.ClassRealm.loadClass(ClassRealm.java:239) ... 54 more [INFO] ------------------------------------------------------------------------ [INFO] BUILD FAILURE [INFO] ------------------------------------------------------------------------ [INFO] Total time: 8.816 s [INFO] Finished at: 2017-03-31T19:11:40+00:00 [INFO] Final Memory: 17M/161M [INFO] ------------------------------------------------------------------------ [ERROR] Failed to execute goal org.jetbrains.kotlin:kotlin-maven-plugin:1.1.1:compile (compile) on project minic: Execution compile of goal org.jetbrains.kotlin:kotlin-maven-plugin:1.1.1:compile failed: A requinetworking class was missing while executing org.jetbrains.kotlin:kotlin-maven-plugin:1.1.1:compile: com/intellij/util/Processor [ERROR] ----------------------------------------------------- [ERROR] realm = plugin>org.jetbrains.kotlin:kotlin-maven-plugin:1.1.1 [ERROR] strategy = org.codehaus.plexus.classworlds.strategy.SelfFirstStrategy [ERROR] urls[0] = file:/home/travis/.m2/repository/org/jetbrains/kotlin/kotlin-maven-plugin/1.1.1/kotlin-maven-plugin-1.1.1.jar [ERROR] urls[1] = file:/home/travis/.m2/repository/org/codehaus/plexus/plexus-utils/1.1/plexus-utils-1.1.jar [ERROR] Number of foreign imports: 1 [ERROR] import: Entry[import from realm ClassRealm[maven.api, parent: null]]